{"text_format":"1","workbook":"xlsx","n_sheets":7,"sheets":["Instructions","Unit Configuration","Section Properties Calculator","Calculations","Wall Weight Calculator","STC_OITC Calculator","STC_OITC Lookup Table"],"not_rendered":{"charts":0,"images":12,"macros":1,"external_links":0,"defined_names":17,"comments":2,"pivot_tables":0},"unopened":[],"bounds":{"document_bytes":16777216,"sheet_cells":100000,"rows_first":2000,"rows_last":500,"rows_between":2000,"halvings":0,"cell_chars":16384,"cell_head_chars":4096},"cells_cut":0,"cells_raw":0,"read":"whole","date_system":"1900"}

{"sheet":"Instructions","index":0,"n_rows":0,"n_cols":0,"rows_kept":0,"cut":false,"hidden":false,"merged":[]}

{"sheet":"Unit Configuration","index":1,"n_rows":56,"n_cols":14,"rows_kept":56,"cut":false,"hidden":false,"merged":[[47,0,47,3],[30,5,30,6],[31,5,31,6],[32,5,32,6],[10,2,10,5],[11,2,11,5],[12,2,12,5],[13,2,13,5]]}
[]
[]
[]
[]
[]
[]
["NCMA Section Properties of Concrete Masonry Walls"]
["User Input Page"]
[]
["Step 1: Project/Unit Details"]
["Date"]
["Project Name"]
["Project Number"]
["Unit Description"]
[]
[]
[]
["Step 2a: Select Pre-defined Unit Configuration or;",null,null,null,null,null,null,null,null,null,"Figure 1 - Web Location Example"]
[]
[]
{"$rows_left_out":37}
{"sheet":"Section Properties Calculator","index":2,"n_rows":36,"n_cols":10,"rows_kept":36,"cut":false,"hidden":false,"merged":[[35,1,35,9],[8,7,8,8],[7,7,7,8],[6,7,6,8],[6,0,6,1],[11,0,11,2],[9,0,9,1],[10,0,10,1],[9,7,12,10],[11,3,11,4],[14,1,16,1],[14,2,16,2],[14,3,15,5],[14,6,15,9],[12,0,12,1],[5,0,5,2],[7,0,7,1],[8,0,8,1],[12,3,12,4],[7,9,7,10],[8,9,8,10],[5,7,5,10],[6,9,6,10],[0,8,0,10],[0,6,0,7],[1,6,1,7],[2,6,2,7],[3,6,3,7],[1,8,1,10],[2,8,2,10],[3,8,3,10]]}
[null,null,null,null,null,null,"Date:",null,{"$f":"'Unit Configuration'!C11","v":"00:00:00"}]
[null,null,null,null,null,null,"Project Name:",null,{"$f":"'Unit Configuration'!C12","v":0}]
[null,null,null,null,null,null,"Project Number:",null,{"$f":"'Unit Configuration'!C13","v":0}]
[null,null,null,null,null,null,"Unit Description:",null,{"$f":"'Unit Configuration'!C14","v":0}]
[]
["General Unit Info",null,null,"Webs","Location","Height","Thickness","ASTM C90 Web and Face shell Requirements"]
["Specified Unit Width (in.)",null,{"$f":"'Unit Configuration'!F31","v":7.625},{"$f":"IF('Unit Configuration'!F44=\"\",\"\",\"X1 (in.)\")","v":"X1 (in.)"},{"$f":"IF(D7=\"\",\"\",'Unit Configuration'!I44)","v":0},{"$f":"IF(D7=\"\",\"\",Calculations!H3)","v":7.625},{"$f":"IF(D7=\"\",\"\",Calculations!F3)","v":1},"Normalized Web Area?",null,{"$f":"IF(G12>=6.5,\"Complies with ASTM C90\",\"Does not comply\")","v":"Complies with ASTM C90"}]
["Specified Unit Height (in.)",null,{"$f":"'Unit Configuration'!F32","v":7.625},{"$f":"IF('Unit Configuration'!F45=\"\",\"\",\"X2 (in.)\")","v":"X2 (in.)"},{"$f":"IF(D8=\"\",\"\",'Unit Configuration'!I45)","v":7.3125},{"$f":"IF(D8=\"\",\"\",Calculations!H4)","v":7.625},{"$f":"IF(D8=\"\",\"\",Calculations!F4)","v":1},"Faceshell Thicknesses?",null,{"$f":"IF(AND(Calculations!G13,Calculations!G14),\"Complies with ASTM C90\",\"Does not comply\")","v":"Complies with ASTM C90"}]
["Specified Unit Length (in.)",null,{"$f":"'Unit Configuration'!F33","v":15.625},{"$f":"IF('Unit Configuration'!F46=\"\",\"\",\"X3 (in.)\")","v":"X3 (in.)"},{"$f":"IF(D9=\"\",\"\",'Unit Configuration'!I46)","v":14.625},{"$f":"IF(D9=\"\",\"\",Calculations!H5)","v":7.625},{"$f":"IF(D9=\"\",\"\",Calculations!F5)","v":1},"Web Thicknesses?",null,{"$f":"IF(MIN(G7:G11)>=0.75,\"Complies with ASTM C90\",\"Does not comply\")","v":"Complies with ASTM C90"}]
[{"$f":"IF('Unit Configuration'!D36=\"NO\",\"Faceshell thicknesses (in.)\",\"First faceshell thickness (in.)\")","v":"Faceshell thicknesses (in.)"},null,{"$f":"'Unit Configuration'!D37","v":1.25},{"$f":"IF('Unit Configuration'!F47=\"\",\"\",\"X4 (in.)\")","v":""},{"$f":"IF(D10=\"\",\"\",'Unit Configuration'!I47)","v":""},{"$f":"IF(D10=\"\",\"\",Calculations!H6)","v":""},{"$f":"IF(D10=\"\",\"\",Calculations!F6)","v":""},{"$f":"IF(AND('Unit Configuration'!N43=\"Yes\",Calculations!G50=TRUE,'Unit Configuration'!D31>=6),\"\",\"The entered configuration cannot be partially grouted or have a full mortar bed. These values have been eliminated from consideration and will show as blank spaces on the table\")","v":"The entered configuration cannot be partially grouted or have a full mortar bed. These values have been eliminated from consideration and will show as blank spaces on the table"}]
[{"$f":"IF('Unit Configuration'!D36=\"YES\",\"Second faceshell thickness (in.)\",\"\")","v":""},null,{"$f":"IF(COUNTBLANK('Section Properties Calculator'!A11),\"\",'Unit Configuration'!D38)","v":""},{"$f":"IF('Unit Configuration'!F48=\"\",\"\",\"X5 (in.)\")","v":""},{"$f":"IF(D11=\"\",\"\",'Unit Configuration'!I48)","v":""},{"$f":"IF(D11=\"\",\"\",Calculations!H7)","v":""},{"$f":"IF(D11=\"\",\"\",Calculations!F7)","v":""}]
["Mortar Info",null,null,"Normalized Web Area (in2/ft2)",null,null,{"$f":"'Unit Configuration'!D54","v":25.734375}]
["Mortar Thickness (in.)",null,{"$f":"'Unit Configuration'!D30","v":0.375},"Direction of Span",null,null,"Vertical"]
[]
[null,{"$f":"IF(G13=\"Vertical\",\"Grout Spacing (in.)\",\"Bond Beam Spacing (in.)\")","v":"Grout Spacing (in.)"},"Mortar Bedding",{"$f":"IF(G13=\"Vertical\",\"Horizontal Net Cross-Sectional Properties\",\"Vertical Net Cross-Sectional Properties\")","v":"Horizontal Net Cross-Sectional Properties"},null,null,{"$f":"IF(G13=\"Vertical\",\"Horizontal Average Cross-Sectional Properties\",\"Vertical Average Cross-Sectional Properties\")","v":"Horizontal Average Cross-Sectional Properties"}]
[]
[null,null,null,"An (in2/ft)","In (in4/ft)","Sn (in3/ft)","Aavg (in2/ft)","Iavg (in4/ft)","Savg (in3/ft)","ravg (in)"]
[null,{"$f":"IF($G$13=\"Vertical\",Calculations!B20,Calculations!B96)","v":"None"},{"$f":"IF($G$13=\"Vertical\",Calculations!C20,Calculations!C96)","v":"Face shell"},{"$f":"IF($G$13=\"Vertical\",Calculations!D20,Calculations!D96)","v":30},{"$f":"IF($G$13=\"Vertical\",Calculations!E20,Calculations!E96)","v":308.7109375},{"$f":"IF($G$13=\"Vertical\",Calculations!F20,Calculations!F96)","v":80.973360655737707},{"$f":"IF($G$13=\"Vertical\",Calculations!G20,Calculations!G96)","v":41.53125},{"$f":"IF($G$13=\"Vertical\",Calculations!H20,Calculations!H96)","v":333.9505615234375},{"$f":"IF($G$13=\"Vertical\",Calculations!I20,Calculations!I96)","v":87.593589907786878},{"$f":"IF($G$13=\"Vertical\",Calculations!J20,Calculations!J96)","v":2.8356562825665761}]
[null,{"$f":"IF($G$13=\"Vertical\",Calculations!B21,Calculations!B97)","v":"None"},{"$f":"IF($G$13=\"Vertical\",Calculations!C21,Calculations!C97)","v":"Full"},{"$f":"IF($G$13=\"Vertical\",Calculations!D21,Calculations!D97)","v":41.53125},{"$f":"IF($G$13=\"Vertical\",Calculations!E21,Calculations!E97)","v":333.9505615234375},{"$f":"IF($G$13=\"Vertical\",Calculations!F21,Calculations!F97)","v":87.593589907786878},{"$f":"IF($G$13=\"Vertical\",Calculations!G21,Calculations!G97)","v":41.53125},{"$f":"IF($G$13=\"Vertical\",Calculations!H21,Calculations!H97)","v":333.9505615234375},{"$f":"IF($G$13=\"Vertical\",Calculations!I21,Calculations!I97)","v":87.593589907786878},{"$f":"IF($G$13=\"Vertical\",Calculations!J21,Calculations!J97)","v":2.8356562825665761}]
[null,{"$f":"IF($G$13=\"Vertical\",Calculations!B22,Calculations!B98)","v":"None"},{"$f":"IF($G$13=\"Vertical\",Calculations!C22,Calculations!C98)","v":"Full"},{"$f":"IF($G$13=\"Vertical\",Calculations!D22,Calculations!D98)","v":91.5},{"$f":"IF($G$13=\"Vertical\",Calculations!E22,Calculations!E98)","v":443.322265625},{"$f":"IF($G$13=\"Vertical\",Calculations!F22,Calculations!F98)","v":116.28125},{"$f":"IF($G$13=\"Vertical\",Calculations!G22,Calculations!G98)","v":91.5},{"$f":"IF($G$13=\"Vertical\",Calculations!H22,Calculations!H98)","v":443.322265625},{"$f":"IF($G$13=\"Vertical\",Calculations!I22,Calculations!I98)","v":116.28125},{"$f":"IF($G$13=\"Vertical\",Calculations!J22,Calculations!J98)","v":2.2011479012854482}]
{"$rows_left_out":17}
{"sheet":"Calculations","index":3,"n_rows":149,"n_cols":15,"rows_kept":149,"cut":false,"hidden":true,"merged":[[16,0,16,9],[38,2,38,9],[48,4,48,6],[93,0,94,0],[93,1,94,1],[93,2,94,2],[93,3,93,5],[93,6,93,9],[92,0,92,9],[17,0,18,0],[17,1,18,1],[17,2,18,2],[17,3,17,5],[17,6,17,9],[1,0,1,11],[9,3,9,8],[10,3,10,4],[10,5,10,6],[10,7,10,8],[141,3,141,5],[119,0,119,11],[114,4,114,5],[120,0,121,0],[120,1,121,1],[120,2,121,2],[120,3,121,3],[120,4,121,4],[120,5,121,5],[120,8,120,14],[120,6,121,6],[120,7,121,7]]}
[]
["Known Information"]
["Unit Width =",{"$f":"'Unit Configuration'!F31","v":7.625},"tfs1 =",{"$f":"'Unit Configuration'!D37","v":1.25},"tweb1 =",{"$f":"'Unit Configuration'!D43","v":1},"hweb1 =",{"$f":"IF(AND('Unit Configuration'!$N$43=\"yes\",'Unit Configuration'!$D$41>=1),'Unit Configuration'!$F$32,'Unit Configuration'!N44)","v":7.625},"Aweb1",{"$f":"F3*H3","v":7.625},"Total Specified Face Shell Area",{"$f":"(D3+D4)*B5","v":39.0625}]
["Unit Height =",{"$f":"'Unit Configuration'!F32","v":7.625},"tfs2 =",{"$f":"IF('Unit Configuration'!D36=\"No\",'Unit Configuration'!D37,'Unit Configuration'!D38)","v":1.25},"tweb2 =",{"$f":"IF(AND($L$8>=2,'Unit Configuration'!$D$42=\"No\"),'Unit Configuration'!$D$43,'Unit Configuration'!$D44)","v":1},"hweb2 =",{"$f":"IF(AND('Unit Configuration'!$N$43=\"yes\",'Unit Configuration'!$D$41>=2),'Unit Configuration'!$F$32,'Unit Configuration'!N45)","v":7.625},"Aweb2",{"$f":"F4*H4","v":7.625},"Total Nominal Face Shell Area",{"$f":"(D3+D4)*B8","v":40}]
["Unit Length =",{"$f":"'Unit Configuration'!F33","v":15.625},"tmj =",{"$f":"'Unit Configuration'!D30","v":0.375},"tweb3 =",{"$f":"IF(AND($L$8>=3,'Unit Configuration'!$D$42=\"No\"),'Unit Configuration'!$D$43,'Unit Configuration'!$D45)","v":1},"hweb3 =",{"$f":"IF(AND('Unit Configuration'!$N$43=\"yes\",'Unit Configuration'!$D$41>=3),'Unit Configuration'!$F$32,'Unit Configuration'!N46)","v":7.625},"Aweb3",{"$f":"F5*H5","v":7.625},"Net Web Thickness",{"$f":"SUM(F3:F7)","v":3}]
["Unit Nominal Width =",{"$f":"'Unit Configuration'!D31","v":8},null,null,"tweb4 =",{"$f":"IF(AND($L$8>=4,'Unit Configuration'!$D$42=\"No\"),'Unit Configuration'!$D$43,'Unit Configuration'!$D46)","v":0},"hweb4 =",{"$f":"IF(AND('Unit Configuration'!$N$43=\"yes\",'Unit Configuration'!$D$41>=4),'Unit Configuration'!$F$32,'Unit Configuration'!N47)","v":0},"Aweb4",{"$f":"F6*H6","v":0},"Cell Width (in block)",{"$f":"B3-SUM(D3:D4)","v":5.125}]
["Unit Nominal Height =",{"$f":"'Unit Configuration'!D32","v":8},null,null,"tweb5 =",{"$f":"IF(AND($L$8>4,'Unit Configuration'!$D$42=\"No\"),'Unit Configuration'!$D$43,'Unit Configuration'!$D47)","v":0},"hweb5 =",{"$f":"IF(AND('Unit Configuration'!$N$43=\"yes\",'Unit Configuration'!$D$41>=5),'Unit Configuration'!$F$32,'Unit Configuration'!N48)","v":0},"Aweb5",{"$f":"F7*H7","v":0},"Total Web area",{"$f":"L6*L5","v":15.375}]
["Unit Nominal Length =",{"$f":"'Unit Configuration'!D33","v":16},null,null,null,null,null,null,null,null,"Number of Webs",{"$f":"'Unit Configuration'!D41","v":3}]
[]
[null,null,null,"Design Checks"]
[null,null,null,"Normalized Web Area Check",null,"Faceshell Check",null,"Normalizations"]
[null,null,null,"Total Web Area (in2)",{"$f":"SUM(J3:J7)","v":22.875},"FS Flag Based on Width of Unit",{"$f":"IF('Unit Configuration'!D31<=4,1,IF(AND('Unit Configuration'!D31>4,'Unit Configuration'!D31<8),2,IF('Unit Configuration'!D31>=8,3,)))","v":3},"Length Normalization",{"$f":"12/(B5+D5)","v":0.75}]
[null,null,null,"Total Web Area/Nominal FS Area ",{"$f":"E12/('Unit Configuration'!D33*'Unit Configuration'!D32)","v":0.1787109375},"FS1",{"$f":"IF(AND($G$12=1,D3>=0.75),TRUE,IF(AND($G$12=2,D3>=1),TRUE,IF(AND($G$12=3,D3>=1.25),TRUE,FALSE)))","v":true},"Height Normalization",{"$f":"12/B7","v":1.5}]
[null,null,null,"Normalized Web Area (in2/ft2)",{"$f":"E13*144","v":25.734375},"FS2",{"$f":"IF(AND($G$12=1,D4>=0.75),TRUE,IF(AND($G$12=2,D4>=1),TRUE,IF(AND($G$12=3,D4>=1.25),TRUE,FALSE)))","v":true}]
[null,null,null,"ASTM C90 Compliant?",{"$f":"IF(E14>=6.5,TRUE,FALSE)","v":true}]
[]
["Concrete Masonry Section Properties for Vertically Grouted Walls "]
["Unit Config","Grout Spacing (in.)","Mortar Bedding","Net Cross-Sectional Properties",null,null,"Average Cross-Sectional Properties"]
[null,null,null,"An (in2/ft)","In (in4/ft)","Sn (in3/ft)","Aavg (in2/ft)","Iavg (in4/ft)","Savg (in3/ft)","ravg (in)"]
["Hollow","None","Face shell",{"$f":"L4*I12","v":30},{"$f":"(((1/12)*(B5+D5)*(B3^3))-((1/12)*(B5+D5)*(L6^3)))*I12","v":308.7109375},{"$f":"(E20/($B$3/2))","v":80.973360655737707},{"$f":"SUM(L4,L7)*I12","v":41.53125},{"$f":"(((1/12)*(B5+D5)*(B3^3))-((1/12)*(B5+D5-L5)*(L6^3)))*I12","v":333.9505615234375},{"$f":"(H20/($B$3/2))","v":87.593589907786878},{"$f":"(H20/G20)^0.5","v":2.8356562825665761}]
{"$rows_left_out":130}
{"sheet":"Wall Weight Calculator","index":4,"n_rows":39,"n_cols":10,"rows_kept":39,"cut":false,"hidden":false,"merged":[[0,8,0,10],[6,8,6,10],[7,8,7,10],[19,0,20,0],[19,1,20,1],[19,2,20,2],[19,3,19,9],[15,2,15,3],[16,5,16,6],[17,5,17,6],[16,2,16,3],[15,5,15,6],[8,8,8,10],[9,7,12,10],[14,2,14,7],[1,8,1,10],[2,8,2,10],[3,8,3,10],[5,0,5,2],[5,7,5,10],[8,0,8,1],[11,0,11,2],[10,0,10,1],[12,0,12,1],[9,0,9,1],[6,0,6,1],[7,0,7,1]]}
[null,null,null,null,null,null,null,"Date",{"$f":"'Section Properties Calculator'!I1","v":"00:00:00"}]
[null,null,null,null,null,null,null,"Project Name:",{"$f":"'Section Properties Calculator'!I2","v":0}]
[null,null,null,null,null,null,null,"Project Number:",{"$f":"'Section Properties Calculator'!I3","v":0}]
[null,null,null,null,null,null,null,"Unit Description:",{"$f":"'Section Properties Calculator'!I4","v":0}]
[]
["General Unit Info",null,null,"Webs","Location","Height","Thickness","ASTM C90 Web and Face shell Requirements"]
["Specified Unit Width (in.)",null,{"$f":"'Unit Configuration'!F31","v":7.625},"X1 (in.)",{"$f":"IF(D7=\"\",\"\",'Unit Configuration'!I44)","v":0},{"$f":"IF(D7=\"\",\"\",Calculations!H3)","v":7.625},{"$f":"IF(D7=\"\",\"\",Calculations!F3)","v":1},"Normalized Web Area?",{"$f":"IF(G12>=6.5,\"Complies with ASTM C90\",\"Does not comply\")","v":"Complies with ASTM C90"}]
["Specified Unit Height (in.)",null,{"$f":"'Unit Configuration'!F32","v":7.625},"X2 (in.)",{"$f":"IF(D8=\"\",\"\",'Unit Configuration'!I45)","v":7.3125},{"$f":"IF(D8=\"\",\"\",Calculations!H4)","v":7.625},{"$f":"IF(D8=\"\",\"\",Calculations!F4)","v":1},"Faceshell Thicknesses?",{"$f":"IF(AND(Calculations!G13,Calculations!G14),\"Complies with ASTM C90\",\"Does not comply\")","v":"Complies with ASTM C90"}]
["Specified Unit Length (in.)",null,{"$f":"'Unit Configuration'!F33","v":15.625},"X3 (in.)",{"$f":"IF(D9=\"\",\"\",'Unit Configuration'!I46)","v":14.625},{"$f":"IF(D9=\"\",\"\",Calculations!H5)","v":7.625},{"$f":"IF(D9=\"\",\"\",Calculations!F5)","v":1},"Web Thicknesses?",{"$f":"'Section Properties Calculator'!J9","v":"Complies with ASTM C90"}]
["First Faceshell Thickness (in.)",null,{"$f":"'Unit Configuration'!D37","v":1.25},"X4 (in.)",{"$f":"IF('Unit Configuration'!$D$41>3,'Unit Configuration'!I47,0)","v":0},{"$f":"IF('Unit Configuration'!$D$41>3,Calculations!H6,0)","v":0},{"$f":"IF('Unit Configuration'!$D$41>3,Calculations!F6,0)","v":0},{"$f":"IF(AND('Unit Configuration'!N43=\"Yes\",Calculations!G50=TRUE),\"\",\"The entered configuration cannot be partially grouted or have a full mortar bed. These values have been eliminated from consideration and will show as blank spaces on the table\")","v":"The entered configuration cannot be partially grouted or have a full mortar bed. These values have been eliminated from consideration and will show as blank spaces on the table"}]
["Second Faceshell Thickness (in.)",null,{"$f":"IF('Unit Configuration'!D36=\"Yes\",'Unit Configuration'!D38,'Unit Configuration'!D37)","v":1.25},"X5 (in.)",{"$f":"IF('Unit Configuration'!$D$41>3,'Unit Configuration'!I48,0)","v":0},{"$f":"IF('Unit Configuration'!$D$41>3,Calculations!H7,0)","v":0},{"$f":"IF('Unit Configuration'!$D$41>3,Calculations!F7,0)","v":0}]
["Mortar Info",null,null,"Normalized Web Area (in2/ft2)",null,null,{"$f":"'Section Properties Calculator'!G12","v":25.734375}]
["Mortar Thickness (in.)",null,{"$f":"'Unit Configuration'!D30","v":0.375},"Block Volume (ft3/ft2)",null,null,{"$f":"'Unit Configuration'!D55","v":0.24021176938657407}]
[]
[null,null,"Wall Assembly Configuration"]
[null,null,"Mortar Density (lb/ft3)",null,125,"Grout Density  (lb/ft3)",null,140]
[null,null,"Mortar Bedding",null,{"$f":"'Unit Configuration'!D50","v":0},"Horizontal Grout Placement",null,"Partial"]
[null,null,null,null,null,"Spacing of Horizontally Grouted Bond Beams (in.)",null,"No Grout"]
[]
["Unit Configuration","Vertical Grout Spacing (in.)","Mortar Bedding","Weight of Wall (psf) for CMU densities (pcf) of:"]
{"$rows_left_out":20}
{"sheet":"STC_OITC Calculator","index":5,"n_rows":43,"n_cols":9,"rows_kept":43,"cut":false,"hidden":true,"merged":[[8,0,8,1],[6,8,6,10],[7,8,7,10],[8,8,8,10],[3,8,3,10],[5,0,5,2],[5,7,5,10],[6,0,6,1],[7,0,7,1],[0,8,0,10],[11,0,11,2],[36,2,36,6],[17,2,17,4],[14,2,14,7],[15,2,15,3],[15,5,15,6],[9,0,9,1],[10,0,10,1],[12,0,12,1],[9,7,12,10],[16,2,16,3],[16,5,16,6],[17,5,17,6],[1,8,1,10],[2,8,2,10]]}
[null,null,null,null,null,null,null,"Date",{"$f":"'Wall Weight Calculator'!I1:K1","v":"00:00:00"}]
[null,null,null,null,null,null,null,"Project Name:",{"$f":"'Wall Weight Calculator'!I2","v":0}]
[null,null,null,null,null,null,null,"Project Number:",{"$f":"'Wall Weight Calculator'!I3","v":0}]
[null,null,null,null,null,null,null,"Unit Description:",{"$f":"'Wall Weight Calculator'!I4","v":0}]
[]
["General Unit Info",null,null,"Webs","Location","Height","Thickness","ASTM C90 Web and Face shell Requirements"]
["Specified Unit Width (in.)",null,{"$f":"'Unit Configuration'!F31","v":7.625},{"$f":"IF('Unit Configuration'!F44=\"\",\"\",\"X1 (in.)\")","v":"X1 (in.)"},{"$f":"IF(D7=\"\",\"\",'Unit Configuration'!I44)","v":0},{"$f":"IF(D7=\"\",\"\",Calculations!H3)","v":7.625},{"$f":"IF(D7=\"\",\"\",Calculations!F3)","v":1},"Normalized Web Area?",{"$f":"IF(G12>=6.5,\"Complies with ASTM C90\",\"Does not comply\")","v":"Complies with ASTM C90"}]
["Specified Unit Height (in.)",null,{"$f":"'Unit Configuration'!F32","v":7.625},{"$f":"IF('Unit Configuration'!F45=\"\",\"\",\"X2 (in.)\")","v":"X2 (in.)"},{"$f":"IF(D8=\"\",\"\",'Unit Configuration'!I45)","v":7.3125},{"$f":"IF(D8=\"\",\"\",Calculations!H4)","v":7.625},{"$f":"IF(D8=\"\",\"\",Calculations!F4)","v":1},"Faceshell Thicknesses?",{"$f":"IF(AND(Calculations!G13,Calculations!G14),\"Complies with ASTM C90\",\"Does not comply\")","v":"Complies with ASTM C90"}]
["Specified Unit Length (in.)",null,{"$f":"'Unit Configuration'!F33","v":15.625},{"$f":"IF('Unit Configuration'!F46=\"\",\"\",\"X3 (in.)\")","v":"X3 (in.)"},{"$f":"IF(D9=\"\",\"\",'Unit Configuration'!I46)","v":14.625},{"$f":"IF(D9=\"\",\"\",Calculations!H5)","v":7.625},{"$f":"IF(D9=\"\",\"\",Calculations!F5)","v":1},"Web Thicknesses?",{"$f":"'Section Properties Calculator'!J9","v":"Complies with ASTM C90"}]
["First Faceshell Thickness (in.)",null,{"$f":"'Unit Configuration'!D37","v":1.25},"X4 (in.)",{"$f":"IF('Unit Configuration'!$D$41>3,'Unit Configuration'!I47,0)","v":0},{"$f":"IF('Unit Configuration'!$D$41>3,Calculations!H6,0)","v":0},{"$f":"IF('Unit Configuration'!$D$41>3,Calculations!F6,0)","v":0},"The following STC/OITC calculations \nwere based off of TMS 302"]
["Second Faceshell Thickness (in.)",null,{"$f":"IF('Unit Configuration'!D36=\"Yes\",'Unit Configuration'!D38,'Unit Configuration'!D37)","v":1.25},"X5 (in.)",{"$f":"IF('Unit Configuration'!$D$41>3,'Unit Configuration'!I48,0)","v":0},{"$f":"IF('Unit Configuration'!$D$41>3,Calculations!H7,0)","v":0},{"$f":"IF('Unit Configuration'!$D$41>3,Calculations!F7,0)","v":0}]
["Mortar Info",null,null,"Normalized Web Area (in2/ft2)",null,null,{"$f":"'Section Properties Calculator'!G12","v":25.734375}]
["Mortar Thickness (in.)",null,{"$f":"'Unit Configuration'!D30","v":0.375},"Block Volume (ft3/ft2)",null,null,{"$f":"'Unit Configuration'!D55","v":0.24021176938657407}]
[]
[null,null,"Wall Assembly Configuration"]
[null,null,"Mortar Density (lb/ft3)",null,{"$f":"'Wall Weight Calculator'!E16","v":125},"Grout Density  (lb/ft3)",null,{"$f":"'Wall Weight Calculator'!H16","v":140}]
[null,null,"Mortar Bedding",null,{"$f":"'Wall Weight Calculator'!E17","v":0},"Grouting Placement",null,{"$f":"'Wall Weight Calculator'!H17","v":"Partial"}]
[null,null,null,null,null,"Horizontal Spacing (in.)",null,{"$f":"'Wall Weight Calculator'!H18","v":"No Grout"}]
[]
[]
{"$rows_left_out":24}
{"sheet":"STC_OITC Lookup Table","index":6,"n_rows":22,"n_cols":8,"rows_kept":22,"cut":false,"hidden":true,"merged":[[0,0,0,7],[15,0,15,1]]}
["STC Finishes"]
[null,"Clay/CMU Veneer Wythe","Drywall on one side of the wall","Drywall on one side of the wall","Drywall on both sides of the Wall","Drywall on both sides of the Wall","Clay/CMU Wythe on one side of the wall and Drywall on the other side of the wall","Clay/CMU Wythe on one side of the wall and Drywall on the other side of the wall"]
["Furring Material Present?",null,"No","Yes","No","Yes","No","Yes"]
["Block Weight (psf)",{"$f":"'STC_OITC Calculator'!$B$23","v":0},{"$f":"'STC_OITC Calculator'!$B$23","v":0},{"$f":"'STC_OITC Calculator'!$B$23","v":0},{"$f":"'STC_OITC Calculator'!$B$23","v":0},{"$f":"'STC_OITC Calculator'!$B$23","v":0},{"$f":"'STC_OITC Calculator'!$B$23","v":0},{"$f":"'STC_OITC Calculator'!$B$23","v":0}]
["Block STC",null,{"$f":"'STC_OITC Calculator'!$B$24","v":0},{"$f":"'STC_OITC Calculator'!$B$24","v":0},{"$f":"'STC_OITC Calculator'!$B$24","v":0},{"$f":"'STC_OITC Calculator'!$B$24","v":0}]
["Wythe Weight (psf)",{"$f":"'STC_OITC Calculator'!$C$40","v":0},null,null,null,null,{"$f":"'STC_OITC Calculator'!$C$40","v":0},{"$f":"'STC_OITC Calculator'!$C$40","v":0}]
["Thickness of the furring space on one side",null,{"$f":"'STC_OITC Calculator'!$C$39","v":0},{"$f":"'STC_OITC Calculator'!$C$39","v":0},{"$f":"'STC_OITC Calculator'!$C$39","v":0},{"$f":"'STC_OITC Calculator'!$C$39","v":0},{"$f":"'STC_OITC Calculator'!$C$39","v":0},{"$f":"'STC_OITC Calculator'!$C$39","v":0}]
["Eqn 1 of TEK Note 13-1C",{"$f":"ROUNDDOWN(20.5*(B4+B6)^0.234,0)","v":0},null,null,null,null,{"$f":"ROUNDDOWN(20.5*(G4+G6)^0.234,0)","v":0},{"$f":"ROUNDDOWN(20.5*(H4+H6)^0.234,0)","v":0}]
["Eqn 2 of TEK Note 13-1C",{"$f":"19.6*(B4+B6)^0.23","v":0},null,null,null,null,{"$f":"19.6*(G4+G6)^0.23","v":0},{"$f":"19.6*(H4+H6)^0.23","v":0}]
["Eqn 3 of TEK Note 13-1C",null,{"$f":"2.8*C7-1.22","v":-1.22},null,null,null,{"$f":"2.8*G7-1.22","v":-1.22}]
["Eqn 4 of TEK Note 13-1C",null,null,null,{"$f":"3.6*E7-2.78","v":-2.78}]
["Eqn 5 of TEK Note 13-1C",null,null,{"$f":"3*D7+1.87","v":1.87},null,null,null,{"$f":"3*H7+1.87","v":1.87}]
["Eqn 6 of TEK Note 13-1C",null,null,null,null,{"$f":"11.2*F7-7.37","v":-7.37}]
["Total STC",{"$f":"ROUNDDOWN(B8*(B4/SUM(B4,B6))+B9*(B6/SUM(B4,B6)),0)","v":{"$error":"#DIV/0!"}},{"$f":"ROUNDDOWN($C$5+C10,0)","v":-1},{"$f":"ROUNDDOWN($C$5+D12,0)","v":1},{"$f":"ROUNDDOWN($C$5+E11,0)","v":-2},{"$f":"ROUNDDOWN($C$5+F13,0)","v":-7},{"$f":"ROUNDDOWN(G8*(G4/SUM(G4,G6))+G9*(G6/SUM(G4,G6))+G10,0)","v":{"$error":"#DIV/0!"}},{"$f":"ROUNDDOWN(H8*(H4/SUM(H4,H6))+H9*(H6/SUM(H4,H6))+H12,0)","v":{"$error":"#DIV/0!"}}]
[]
["OITC Finishes"]
[null,"Clay/CMU Veneer Wythe"]
["Block Weight (psf)",{"$f":"'STC_OITC Calculator'!$B$23","v":0}]
["Wythe Weight (psf)",{"$f":"'STC_OITC Calculator'!$C$40","v":0}]
["Eqn 1 of TEK Note 13-1C",{"$f":"ROUNDDOWN(14.7*(B18+B19)^0.29,0)","v":0}]
{"$rows_left_out":2}